Ontología BNE
type: Ontology
contributor: Daniel Vila-Suero Celia Marcos Serrano Aída Martínez Vázquez Laura Guindal Martínez Lourdes Alonso Viana Ricardo Santos Munoz Memorandum Multimedia
creator: Biblioteca Nacional de España
abstract: La ontología de la Biblioteca Nacional de España (BNE) es el modelo de datos central que se utiliza en datos.bne.es, la base de conocimiento abierta de la BNE. datos.bne.es recoge, integra y estructura información del catálogo y las digitalizaciones producidas en los sistemas de información de la BNE poniendola disponible utilizando tecnologías semánticas y datos enlazados.
abstract: The ontology of National Library of Spain (BNE) is the core data model undelying the Linked Data solution of BNE: datos.bne.es. datos.bne.es is an open knowledge base that gathers, integrates and delivers the full catalogue in open and semantically enriched formats. @en
created: 2014-3-11
license: http://creativecommons.org/licenses/by-nc-sa/2.0/
modified: 2019-2-11
title: BNE ontology @en
example: http://datos.bne.es/resource/XX1147441
preferred namespace prefix: bneonto
version info: 2.0

es creada por (persona)
type: ObjectProperty
sub property of: P10437
inverse of: es creador de (persona)
domain: Obra
range: Persona
label: Autor
comment: Relaciona una obra con una persona que se considera autora de su contenido intelectual o artístico
comment: Relates a work to a person who is responsible for a work. [source: http://rdaregistry.info/Elements/w/P10437] @en
label: is created by (person) @en

es realizada a través de
type: ObjectProperty
sub property of: P2001
sub property of: P10078
inverse of: es realización de
domain: Obra
range: Expresión
label: Versión
comment: Relaciona una obra con una expresión que la realiza @en
comment: Relates a work to an expression that is the realization of the work. [source: http://iflastandards.info/ns/fr/frbr/frbrer/P2001] @en
label: is realized through @en

tiene parte (obra)
type: ObjectProperty
sub property of: P2057
sub property of: P10147
inverse of: forma parte de (obra)
domain: Obra
range: Obra
comment: Relaciona una obra con obra que es parte componente de ella
comment: Relates a work to another work that is a component of the work. [source: http://iflastandards.info/ns/fr/frbr/frbrer/P2057 ] @en
label: has part (work) @en

forma parte de (obra)
type: ObjectProperty
sub property of: P2058
sub property of: P10019
domain: Obra
range: Obra
comment: Relaciona una obra con otra obra de la que es parte
comment: Relates a work to another work of which it is a component [source: http://iflastandards.info/ns/fr/frbr/frbrer/P2058] @en
label: is part of work (work) @en

es creada por (entidad corporativa)
type: ObjectProperty
sub property of: P10531
inverse of: es creador de (entidad corporativa)
domain: Obra
range: Entidad Corporativa
comment: Relaciona una obra con una entidad corporativa que se considera autora de su contenido intelectual o artístico
comment: Relates a work to a corporate body who is responsible for a work. [source: http://rdaregistry.info/Elements/w/P10531] @en
label: is created by (corporate body) @en

tiene como materia (obra)
type: ObjectProperty
sub property of: P10257
inverse of: es materia de (obra)
domain: Obra
range: Obra
comment: Relaciona una obra con una obra, que es tema de la primera
comment: Relates a work to a work that a work is about. @en
label: has as subject (work) @en

es materia de (obra)
type: ObjectProperty
sub property of: P10264
domain: Obra
range: Obra
comment: Relaciona una Obra con una obra que trata sobre ella
comment: Relates a Work to a work that is about the work @en
label: is subject (work) of @en

tiene como materia (persona)
type: ObjectProperty
sub property of: P10261
inverse of: es materia (persona) de
domain: Obra
range: Persona
comment: Relaciona una obra con una persona, que es tema de dicha obra
comment: Relates a work to a person that a work is about. @en
label: has subject (person) @en

tiene como materia (expresión)
type: ObjectProperty
sub property of: P10258
inverse of: es materia (expresión) de
domain: Obra
range: Expresión
comment: Relaciona una obra con una expresión, que es tema de dicha obra
comment: Relates a work to a expression that a work is about. @en
label: has as subject (expression) @en

tiene como materia (entidad corporativa)
type: ObjectProperty
sub property of: P10263
inverse of: es materia (entidad corporativa) de
domain: Obra
range: Entidad Corporativa
comment: Relaciona una obra con una entidad corporativa, que es tema de dicha obra
comment: Relates a work to a corporate body that a work is about. @en
label: has as subject (corporate body) @en

está materializada en
type: ObjectProperty
sub property of: P60313
inverse of: es materialización de
domain: Expresión
range: Recurso
comment: Relaciona una expresión con un recurso, esto es, una materialización física de la expresión
comment: Relates an expression to a resource, id est, a physical embodiment of an expression. @en
label: is embodied in @en

es realización de
type: ObjectProperty
sub property of: P2002
sub property of: P20231
domain: Expresión
range: Obra
comment: Relaciona una expresión con una obra que se realiza a través de ella
comment: Relates an expression to the work that is realized through the expression [source: FRBRer: http://iflastandards.info/ns/fr/frbr/frbrer/P2002] @en
label: is realization of @en

tiene parte (expresión)
type: ObjectProperty
sub property of: P2079
sub property of: P20145
inverse of: forma parte (expresión) de
domain: Expresión
range: Expresión
comment: Relaciona una expresión con otra que es parte de ella
comment: Relates an expression to another expression that is a component of the expression. [source: http://iflastandards.info/ns/fr/frbr/frbrer/P2079] @en
label: has part (expression) @en

forma parte (expresión) de
type: ObjectProperty
sub property of: P2080
sub property of: P20074
domain: Expresión
range: Expresión
comment: Relaciona una expresión con otra expresión de la que es parte
comment: Relates an expression to another expression of which it is a component. [source: http://iflastandards.info/ns/fr/frbr/frbrer/P2080] @en
label: is part (expression) of @en

es materia (expresión) de
type: ObjectProperty
sub property of: P20268
domain: Expresión
range: Obra
comment: Relaciona una Expresión con una obra que trata sobre ella
comment: Relates an expression to a work that is about the expression @en
label: is subject (expression) of @en

está ejemplificado por
type: ObjectProperty
inverse of: es ejemplar de
domain: Recurso
range: Ejemplar
comment: Relaciona un recurso con un ejemplar concreto que lo contiene
comment: Relates a resource to an item that is a single instance of the resource. @en
label: is exemplified by @en

es materialización de
type: ObjectProperty
sub property of: P60313
domain: Recurso
range: Expresión
comment: Relaciona un recurso con la expresión que está contenida en el recurso
comment: Relates a resource to an expression that is embodied by the resource @en
label: is embodiment of @en

es creado (recurso) por (persona)
type: ObjectProperty
sub property of: P60447
inverse of: es creador (persona) de (recurso)
domain: Recurso
range: Persona
comment: Relaciona directamente un recurso con una persona que se considera el creador de su contenido intelectual o artístico, cuando no se ha podido inferir la obra que contiene
comment: Relates directly a resource to a corporate body which is considered the creator of its intelectual or artistic content, when no work could be inferrer or ascertained @en
label: is created (resource) by (person) @en

es creado (recurso) por (entidad corporativa)
type: ObjectProperty
sub property of: P60447
inverse of: es creador (entidad corporativa) de (recurso)
domain: Recurso
range: Entidad Corporativa
comment: Relaciona directamente un recurso con una entidad corporativa que se considera el creador de su contenido intelectual o artístico, cuando no se ha podido inferir la obra que contiene
comment: Relates directly a resource to a corporate body which is considered the creator of its intelectual or artistic content, when no work could be inferrer or ascertained @en
label: is created (resource) by (corporate body) @en

contribuye (persona) a (recurso)
type: ObjectProperty
inverse of: tiene contribuidor
domain: Persona
range: Recurso
comment: Relaciona una persona con un recurso con la que tiene un grado de responsabilidad no determinado (traductor, ilustrador, editor literario, coautor)
comment: Relates a person with a resource that involves an uncertain degree of responsability (translator, illustrator, editor, co-author) @en
label: contributes (person) to (recurso) @en

tiene contribuidor
type: ObjectProperty
sub property of: P60626
domain: Recurso
range: Persona
label: Participante
label: has contributor @en

tiene relación
type: ObjectProperty
sub property of: P60313
domain: Recurso
comment: Relaciona un recurso con una obra o expresión con la que guarda una relación de contenido o derivativa
comment: Relates a resource with a work or expression related. This can be a content or derivative relationship @en
label: has relation @en

tiene como materia
type: ObjectProperty
sub property of: P60805
domain: Recurso
label: Tema
comment: Relaciona un recurso con el tema que tiene como objeto. Este tema puede corresponder a cualquiera de las clases de la ontología
comment: Relates a resource with the subject it is about. The range of this relación can be any of the classes @en
label: has subject @en

Continuado por
type: ObjectProperty
domain: Recurso
range: Recurso

Es continuación de
type: ObjectProperty
domain: Recurso
range: Recurso

Publicado con
type: ObjectProperty
sub property of: P60256
domain: Recurso
range: Recurso
comment: Relaciona un recurso con otro con el que se publica conjuntamente
comment: Relates a resource to a resource that is issued on the same carrier as a manifestation being described. @en
label: Issued with @en

es ejemplar de
type: ObjectProperty
sub property of: P40095
domain: Ejemplar
range: Recurso
comment: "Relates an item to a resource that is exemplified by an item." @en
comment: Relaciona un ejemplar con un recurso del cual es un ejemplar
label: is exemplar of @en

es creador de (persona)
type: ObjectProperty
sub property of: P50542
domain: Persona
range: Obra
comment: Relaciona una persona con una obra con la que tiene la principal responsabilidad en la creación de su contenido
comment: Relates a person to a work that involves a responsibility of a person for creation [source: http://www.rdaregistry.info/Elements/a/#P50542] @en
label: is creator of (person) @en

es creador (persona) de (recurso)
type: ObjectProperty
sub property of: P60672
domain: Persona
range: Recurso
comment: Relaciona una persona directamente con un recurso de la cual se le considera autora, cuando la obra no ha podido ser inferida
comment: Relates directly a person to a resource that involves a creation responsibility, when the work could not be inferred or ascertained @en
label: is creator (person) of (resource) @en

es materia (persona) de
type: ObjectProperty
sub property of: P50249
domain: Persona
range: Obra
comment: Relaciona una Persona con una obra que trata sobre ella
comment: Relates a Person to a work that is about the person @en
label: is subject (person) of @en

es creador de (entidad corporativa)
type: ObjectProperty
sub property of: P50844
domain: Entidad Corporativa
range: Obra
comment: Relaciona una entidad corporativa con una obra con la que tiene la principal responsabilidad en la creación de su contenido
comment: Relates a corporate body to a work that involves a responsibility of a corporate body for creation. [source: http://rdaregistry.info/Elements/a/P50844] @en
label: is creator (corporate body) of @en

es subordinado de
type: ObjectProperty
sub property of: P4014
sub property of: P50008
inverse of: tiene subordinado
domain: Entidad Corporativa
range: Entidad Corporativa
comment: Relaciona una Entidad Corporativa con otra Entidad Corporativa que es su subordinada jerárquicamente
comment: Relates a corporate body to another corporate body which is subordinate to the prior corporate body. [source: http://iflastandards.info/ns/fr/frad/P4014] @en
label: is subordinate of @en

tiene subordinado
type: ObjectProperty
sub property of: P4014
sub property of: P50010
domain: Entidad Corporativa
range: Entidad Corporativa
comment: Relaciona una entidad corporativa con otra que es su subordinada jerárquica
comment: Relates a corporate body to another corporate body which is subordinate to the prior corporate body. [source: http://iflastandards.info/ns/fr/frad/P4014] @en
label: has subordinate @en

es creador (entidad corporativa) de (recurso)
type: ObjectProperty
sub property of: P60672
domain: Entidad Corporativa
range: Recurso
comment: Relaciona una entidad corporativa directamente con un recurso de la cual se le considera autora, cuando la obra no ha podido ser inferida
comment: Relates directly a corporate body to a resource that involves a creation responsibility, when the work could not be inferred or ascertained @en
label: is creator (corporate body) of (resource) @en

es materia (entidad corporativa) de
type: ObjectProperty
sub property of: P50251
domain: Entidad Corporativa
range: Obra
comment: Relaciona una Entidad Corporativa con una obra que trata sobre ella
comment: Relates a corporate body to a work that is about a corporate body. @en
label: is subject (corporate body) of @en

tiene como materia (concepto)
type: ObjectProperty
sub property of: P10256
domain: Obra
comment: Relaciona una obra con un objeto que tiene como tema
comment: Relates a work to a concept that a work is about. @en
label: has as subject (concept) @en

tiene título de la obra
type: DatatypeProperty
domain: Obra
label: Title @en
label: Título
label: has title of the work @en

fuente consultada
type: DatatypeProperty
domain: Obra
label: Fuente consultada
label: Source consulted @en
label: source consulted @en

información encontrada
type: DatatypeProperty
domain: Obra
label: Información encontrada
label: Information found @en
label: citation note @en

tiene fecha de la obra
type: DatatypeProperty
domain: Obra
label: Date @en
label: Fecha @fecha
label: has date of the work @en

tiene otra variante de nombre (obra)
type: DatatypeProperty
domain: Obra
label: Otro título
label: Variant title @en
label: has other variant name (work) @en

numeración de parte
type: DatatypeProperty
domain: Obra
label: Number @en
label: Número
label: numbering of part @en

nota del catalogador
type: DatatypeProperty
domain: Obra
label: Cataloger's note @en
label: Nota del catalogador
label: cataloguer's note @en

tiene medio de interpretación (obra musical)
type: DatatypeProperty
domain: Obra
label: Medio de interpretación
label: Medium of performance @en
label: has medium of performance (musical work) @en

tiene clave (obra musical)
type: DatatypeProperty
domain: Obra
label: Key @en
label: Tonalidad
label: has key (musical work) @en

firmante del tratado
type: DatatypeProperty
domain: Obra
label: Firmante del tratado
label: Signatory to the treaty @en
label: Signatory to a treaty, etc. @en

etiqueta asociada al autor
type: DatatypeProperty
sub property of: P61027
domain: Obra
domain: Recurso
comment: Cadena de texto con el nombre del autor de una obra o recurso. Utilizado para mejorar las búsquedas en el interfaz web @en
comment: Text string identifying an author of a work or a resource. Used to enhance web interface search capabilities @en
label: label associated with author @en

label of part
type: DatatypeProperty

tiene lengua de la expresión
type: DatatypeProperty
domain: Expresión
label: Language @en
label: Lengua
label: has language of expression @en

tiene otras características distintivas de expresión
type: DatatypeProperty
domain: Expresión
label: Form @en
label: Forma
label: has other distinguishing characteristic of expression @en

tiene nombre de editor, productor, distribuidor
type: DatatypeProperty
sub property of: P1017
sub property of: P60444
domain: Recurso
comment: Relaciona un recurso con el nombre de la persona o entidad corporativa que aparece en el recurso que lleva a cabo, respectivamente, la publicación, producción y/o distribución o las actividades de difusión del recurso. [Fuente: http://metadataregistry.org/schemapropel/list/schema_property_id/1958.html]
comment: Relates a resource to the name of the person or corporate body appearing on the resource that effects respectively the publication, production and/or distribution or release activities for the resource. [Source: http://metadataregistry.org/schemapropel/list/schema_property_id/1958.html] @en
label: has name of publisher, producer, distributor @en

tiene título propiamente dicho
type: DatatypeProperty
sub property of: P1004
sub property of: P60515
domain: Recurso
comment: Relaciona un recurso con el título propiamente dicho (el nombre principal de un recurso, es decir, el título de un recurso en la forma en la que aparece en la fuente preferida de información para el recurso). [Fuente: http://metadataregistry.org/schemapropel/list/schema_property_id/1945.html]
comment: Relates a resource to the title proper (the chief name of a resource, i.e. the title of a resource in the form in which it appears on the preferred source of information for the resource). [Source: http://metadataregistry.org/schemapropel/list/schema_property_id/1945.html] @en
label: has title proper @en

tiene lugar de publicación, producción, distribución
type: DatatypeProperty
sub property of: P1016
sub property of: P60547
domain: Recurso
comment: Relaciona un recurso con el nombre de un lugar asociado en la fuente de información prescrita con el nombre del editor, productor o distribuidor. [Fuente: http://metadataregistry.org/schemapropel/list/schema_property_id/1957.html]
comment: Relates a resource to the name of the place associated on the prescribed source of information with the name of the publisher, producer or distributor. [Source: http://metadataregistry.org/schemapropel/list/schema_property_id/1957.html] @en
label: has place of publication, production, distribution @en

tiene designación específica del material y extensión
type: DatatypeProperty
sub property of: P1022
sub property of: P60550
domain: Recurso
comment: Relaciona un recurso con una mención incluyendo la designación específica de material, la extension, la mención de paginación (si es un recurso impreso) y la duración (si el recurso tiene un aspecto inherente de duración). [Fuente: http://metadataregistry.org/schemapropel/list/schema_property_id/1963.html]
comment: Relates a resource to a statement including the specific material designation, the extent, the pagination statement (if a printed resource), and the playing time (if the resource has an inherent durational aspect). [Source: http://metadataregistry.org/schemapropel/list/schema_property_id/1963.html] @en
label: has specific material designation and extent @en

tiene mención de forma del contenido y de tipo de medio
type: DatatypeProperty
domain: Recurso
label: Content form @en
label: Tipo de material
label: has content form and media type statement @en

tiene fecha de publicación, producción, distribución
type: DatatypeProperty
sub property of: P1018
sub property of: P60073
domain: Recurso
comment: Relaciona un recurso con la fecha en que oficialmente se ha ofrecido para la venta o distribución al público, normalmente se da en la forma de un año. [Fuente: http://metadataregistry.org/schemapropel/list/schema_property_id/1959.html] Si la fecha no es conocida, puede darse como rango, siglo, o fecha aproximada (ej: 189?, 17??, ca. 1776...)
comment: Relates a resource to the date on which it is officially offered for sale or distribution to the public, usually given in the form of a year. [Source: http://metadataregistry.org/schemapropel/list/schema_property_id/1959.html] If the date is unknown, an approximate date can be supplied (s. XVI, 177?...) @en
label: has date of publication, production, distribution @en

tiene dimensiones
type: DatatypeProperty
sub property of: P1024
sub property of: P60539
domain: Recurso
comment: Relaciona un recurso con una nota sobre sus dimensiones en centímetros (o milímetros si se trata de la anchura de una película o cinta) redondeando al número entero más cercano. [Fuente: http://metadataregistry.org/schemapropel/list/schema_property_id/1965.html]
comment: Relates a resource to a note on its dimensions in centimetres (or millimetres if the gauge of a film or width of a tape) rounded up to the nearest whole. [Source: http://metadataregistry.org/schemapropel/list/schema_property_id/1965.html] @en
label: has dimensions @en

tiene mención de responsabilidad relativa al título
type: DatatypeProperty
sub property of: P1007
sub property of: P60339
domain: Recurso
comment: Relaciona un recurso con uno o más nombres, frases, o grupos de caracteres, transcritos literalmente de la publicación, que están relacionados con la identificación y/o función de cualquier persona o entidad corporativa responsables de, o que contribuyen a, la creación o realización del contenido intelectual o artístico de una obra contenida en el recurso. [Fuente: http://metadataregistry.org/schemapropel/list/schema_property_id/1948.html]
comment: Relates a resource to one or more names, phrases, or groups of characters, transcribed from the resource, relating to the identification and/or function of any persons or corporate bodies responsible for or contributing to the creation or realisation of the intellectual or artistic content of a work contained in the resource. [Source: http://metadataregistry.org/schemapropel/list/schema_property_id/1948.html] @en
label: has statement of responsibility relating to title @en

depósito legal
type: DatatypeProperty
sub property of: P1032
sub property of: P60052
domain: Recurso
comment: Llegal deposit number for an item that was acquired by legal deposit requirements. [Source: adapted from MARC21 Format for Bibliographic data; https://www.loc.gov/marc/bibliographic/bd017.html] @en
comment: Número de registro de depósito legal para un documento que se adquirió mediante depósito legal [Fuente: adaptado de Formato MARC21 para registros bibliográficos: http://www.bne.es/webdocs/Inicio/Perfiles/Bibliotecarios/MARC21_registros-bibliograficos.pdf]
label: Identifier for the manifestation @en

tiene otros detalles físicos
type: DatatypeProperty
sub property of: P1023
sub property of: P60804
domain: Recurso
comment: Relaciona un recurso con una mención que incluye la mención relativa al material del que está hecho el recurso, la mención relativa a la presencia de ilustraciones, el tipo específico de ilustración, el número de ilustraciones, la existencia de color, la proporción de reducción (si es una microforma), la existencia o ausencia de sonido (si es un recurso que pueda tener como carácterística el sonido integrado) y otras especificaciones técnicas. [Fuente: http://metadataregistry.org/schemapropel/list/schema_property_id/1964.html]
comment: Relates a resource to a statement including the statement relating to the material of which the resource is composed, the statement relating to the presence of illustrations, the particular type of illustration, the number of illustrations, the presence of colour, the reduction ration (if a microform), the presence or absence of sound (if a resource that may have integral sound as a feature), and other technical specifications. [Source: http://metadataregistry.org/schemapropel/list/schema_property_id/1964.html] @en
label: has other physical details @en

ISBN
type: DatatypeProperty
sub property of: P1032
sub property of: P60052
domain: Recurso
label: ISBN @en
comment: ISBN number @en
comment: Número de ISBN

tiene información complementaria del título
type: DatatypeProperty
sub property of: P1006
sub property of: P60493
domain: Recurso
comment: Relaciona un recurso con una palabra o expresión, o grupo de caracteres que aparecen en conjunción con y subordinados al título propiamente dicho del recurso. [fuente: http://metadataregistry.org/schemapropel/list/schema_property_id/1947.html ]
comment: Relates a resource to a word or phrase, or a group of characters, appearing in conjunction with, and subordinate to, the title proper of the resource. [source: http://metadataregistry.org/schemapropel/list/schema_property_id/1947.html] @en
label: has other title information @en

tiene nota
type: DatatypeProperty
sub property of: P1045
sub property of: P60470
domain: Recurso
comment: Relaciona un recurso con una nota de información descriptiva que no se ha dado en otras áreas de descripción pero que se considera importante para los usuarios de registros bibliográficos. [fuente: http://metadataregistry.org/schemapropel/list/schema_property_id/1986.html]
comment: Relates a resource to a note of descriptive information that has not been given in other areas of the description but that is considered to be important to users of bibliographic records. [source: http://metadataregistry.org/schemapropel/list/schema_property_id/1986.html] @en
label: has note @en

tiene título propiamente dicho de serie o recurso monográfico multiparte
type: DatatypeProperty
sub property of: P1173
sub property of: P60516
domain: Recurso
comment: Relaciona un recurso que es una serie o un recurso monográfico multiparte con una declaración de su título
comment: Relates a resource that is a series or multipart monographic resource to a statement of its title. [source: http://metadataregistry.org/schemapropel/list/schema_property_id/16494.html] @en
label: has title proper of series or multipart monographic resource @en

tiene mención de edición
type: DatatypeProperty
sub property of: P1008
sub property of: P60329
domain: Recurso
comment: Relaciona un recurso con un término, frase o grupo de caracteres que indican que el recurso pertenece a una edición.[fuente: http://metadataregistry.org/schemapropel/list/schema_property_id/1949.html]
comment: Relates a resource to a word or phrase, or a group of characters, indicating that the resource belongs to an edition. [source: http://metadataregistry.org/schemapropel/list/schema_property_id/1949.html] @en
label: has edition statement @en

tiene numeración de serie o recurso monográfico multiparte
type: DatatypeProperty
sub property of: P1031
sub property of: P60081
domain: Recurso
comment: Relaciona un recurso que es una serie o recurso monográfico multiparte con su numeración. [fuente: http://metadataregistry.org/schemapropel/list/schema_property_id/1972.html]
comment: Relates a resource that is a series or multipart monographic resource to its numbering. [source: http://metadataregistry.org/schemapropel/list/schema_property_id/1972.html] @en
label: has numbering within series or multipart monographic resource @en

tiene nombre de impresor o fabricante
type: DatatypeProperty
sub property of: P1020
sub property of: P60546
domain: Recurso
comment: Relaciona un recurso con el nombre de la persona o entidad corporativa que aparece en el recurso que efectúa la impresión o fabricación del recurso. [fuente: http://metadataregistry.org/schemapropel/list/schema_property_id/1961.html]
comment: Relates a resource to the name of the person or corporate body appearing on the resource that effects the printing or manufacturing of the resource. [source: http://metadataregistry.org/schemapropel/list/schema_property_id/1961.html] @en
label: has name of printer or manufacturer @en

número del editor para música (manifestación)
type: DatatypeProperty
sub property of: P1032
sub property of: P60052
domain: Recurso
comment: Formatted number used for sound recordings, printed music, other music-related materials, and video recordings. [source: MARC 21] @en
comment: Números formateados del editor que se utilizan para grabaciones sonoras, videograbaciones, música impresa y otros materiales relacionados con música. [fuente: MARC 21]
label: publisher's number for music (manifestation) @en

tiene nota sobre descripción del material
type: DatatypeProperty
sub property of: P1040
sub property of: P60470
domain: Recurso
comment: Relaciona un recurso con una nota sobre el área de descripción del material. [fuente: http://metadataregistry.org/schemapropel/list/schema_property_id/1981.html]
comment: Relates a resource to a note on the material description area. [source: http://metadataregistry.org/schemapropel/list/schema_property_id/1981.html] @en
label: has note on material description @en

pertenece a serie
type: DatatypeProperty
domain: Recurso
label: Serie o colección
label: Series @en
comment: Punto de acceso adicional de serie que consta únicamente del título de la serie. [fuente: Marc21]
comment: Series added entry consisting of a series title alone [source: Marc 21] @en
label: is in series @en

tiene nota sobre el contenido
type: DatatypeProperty
sub property of: P1042
domain: Recurso
label: Nota de contenido
label: Note on contents @en
comment: Relaciona un recurso con una nota relativa al contenido. [fuente: http://metadataregistry.org/schemapropel/list/schema_property_id/1983.html]
comment: Relates a resource to a note relating to the contents. [source: http://metadataregistry.org/schemapropel/list/schema_property_id/1983.html] @en
label: has note on contents @en

tiene intérprete
type: DatatypeProperty
sub property of: P1087
sub property of: P60130
domain: Recurso
label: Intérpretes
label: Performers @en
comment: Relaciona un recurso con una nota sobre sus menciones de responsabilidad (menciones, transcritas del recurso que se describe, relacionadas con personas responsables del contenido intelectual o artístico del recurso, con entidades corporativas de los cuales emana el contenido, o con personas o entidades corporativas responsables de la ejecución del contenido del recurso). Incluye menciones de responsabilidad tomadas de fuera del recurso, su contenedor o el material textual que lo acompaña; notas sobre formas variantes o ampliadas de nombres de personas u organismos corporativos, notas sobre seudónimos, notas sobre personas o entidades corporativas relacionadas con el trabajo que no pueden incluirse en otras áreas de la descripción (porque, por ejemplo, su función no está especificada) ; menciones de responsabilidad relacionadas con los apéndices y otros asuntos complementarios que aparecen en el recurso pero no en una fuente de información prescrita; notas sobre la puesta en escena, instrumentación, etc., de trabajos realizados; notas sobre personas u organismos relacionados con la producción técnica, las funciones administrativas y de consultoría del trabajo.
comment: Relates a resource to a note on its statements of responsibility (statements, transcribed from the resource being described, relating to persons responsible for the intellectual or artistic content of the resource, to corporate bodies from which the content emanates, or to persons or corporate bodies responsible for the performance of the content of the resource). Includes statements of responsibility taken from outside the resource, its container or accompanying textual matter; notes on variant or expanded forms of names of persons or corporate bodies, notes on pseudonyms, notes on persons or corporate bodies connected with the work that cannot be included in other areas of the description (because, for example, their function is not specified); statements of responsibility relating to appendices and other supplementary matter appearing on the resource but not on a prescribed source of information; notes on the staging, instrumentation, etc., of performed works; notes on persons or bodies connected with the technical production, administrative and consulting functions of the work. [fuente: http://iflastandards.info/ns/isbd/unc/elements/P1087] @en
label: has performer @en

tiene nota de referencia bibliográfica
type: DatatypeProperty
sub property of: P1064
sub property of: P60215
domain: Recurso
label: Bibliographic reference @en
label: Referencia bibliográfica
label: has note on bibliographic reference @en

tiene nota sobre publicación, producción, distribución, etc.
type: DatatypeProperty
domain: Recurso
label: Nota de publicación
label: Note on publication @en
label: has note on publication, production, distribution, etc. @en

tiene lugar de impresión o fabricación
type: DatatypeProperty
sub property of: P1019
sub property of: P60162
domain: Recurso
comment: Relaciona un recurso al nombre del lugar asociado en el recurso con su impresión o fabricación. [Fuente: http://metadataregistry.org/schemapropel/list/schema_property_id/1960.html]
comment: Relates a resource to the name of the place associated on the resource with its printing or manufacture. [Source: http://metadataregistry.org/schemapropel/list/schema_property_id/1960.html] @en
label: has place of printing or manufacturer @en

variante de título (recurso)
type: DatatypeProperty
sub property of: P60355
domain: Recurso
comment: Formas variantes del título que aparecen en diferentes partes de un documento o como parte del título propiamente dicho, o como una forma alternativa del título cuando esta varía sustancialmente respecto a la mención de título y además contribuye a una mejor identificación del documento. [Fuente: MARC21 http://www.bne.es/webdocs/Inicio/Perfiles/Bibliotecarios/MARC21_registros-bibliograficos.pdf]
comment: Varying forms of the title appearing on different parts of an item or a portion of the title proper, or an alternative form of the title when the form differs substantially from the title statement in title proper field and if they contribute to the further identification of the item. [Source: MARC21 Bibliographic Format https://www.loc.gov/marc/bibliographic/bd246.html] @en
label: variant title (resource) @en

tiene mención de material anejo
type: DatatypeProperty
sub property of: P1025
sub property of: P60249
domain: Recurso
label: Accompanying material @en
label: Material de acompañamiento
comment: Relaciona un recurso con una mencion de material anejo (cualquier parte separada físicamente del recurso que se ha publicado (o existe intención de que se publique) al mismo tiempo y destinado para ser utilizado con el recurso). [Fuente: http://iflastandards.info/ns/isbd/elements/P1025]
comment: Relates a resource to a statement on accompanying material (any physically separable part of the resource that is issued (or intended to be issued) at the same time and intended to be used with the resource). [Fuente: http://iflastandards.info/ns/isbd/unc/elements/P1025] @en
label: has accompanying material statement @en

tiene título dependiente de título propiamente dicho
type: DatatypeProperty
sub property of: P1138
sub property of: P60515
domain: Recurso
comment: Relaciona un recurso con un título que por sí mismo es insuficiente para identificar el recurso y que requiere la adición del título común, o del título del recurso principal o del título de la serie principal. [Fuente: http://metadataregistry.org/schemapropel/list/schema_property_id/2112.html]
comment: Relates a resource to a title that by itself is insufficient to identify the resource and that requires the addition of the common title, or the title of the main resource or the title of the main series. [Source: http://metadataregistry.org/schemapropel/list/schema_property_id/2112.html] @en
label: has dependent title of title proper @en

tiene designación numérica
type: DatatypeProperty
sub property of: P1156
sub property of: P60533
domain: Recurso
label: Chronological or sequential designation @en
label: Fechas o secuencia de la revista
comment: Relaciona un recurso que es una publicación seriada con su designación numérica [fuente:http://iflastandards.info/ns/isbd/unc/elements/P1156 ]
comment: Relates a resource that is a serial to its numeric designation [source: http://iflastandards.info/ns/isbd/unc/elements/P1156 ] @en
label: has numeric designation @en

tiene nota de frecuencia
type: DatatypeProperty
sub property of: P1065
sub property of: P60129
domain: Recurso
label: Frequency @en
label: Periodicidad
comment: Relaciona un recurso que es una publicación seriada con una nota de frecuencia. Relaciona un recurso que es un recurso integrable con una nota de frecuencia de actualizaciones [fuente: http://iflastandards.info/ns/isbd/unc/elements/P1065]
comment: Relates a resource that is a serial to a note on the frequency. Relates a resource that is an integrating resource to a note on the frequency of updates. [source: http://iflastandards.info/ns/isbd/unc/elements/P1065] @en
label: has note on frequency @en

tiene designación de título dependiente de título propiamente dicho
type: DatatypeProperty
domain: Recurso
label: Dependent title @en
label: Título dependiente
label: has dependent title designation of title proper @en

tiene nota de relación con otros recursos
type: DatatypeProperty
domain: Recurso
label: Recurso relacionado
label: Related resource @en
label: has note on relationship to other resources @en

tiene mención de escala
type: DatatypeProperty
sub property of: P1047
sub property of: P60565
domain: Recurso
label: Escala
label: Scale @en
comment: Relaciona un recurso cartográfico con la razón matemática entre la distancia en el recurso y la medida real que representa, se da como una fracción representativa, expresada como una ratio (1: ). [Fuente: http://iflastandards.info/ns/isbd/elements/P1047]
comment: Relates a resource that is cartographic to the ratio of distances on the resource to the actual distances they represent, given as a representative fraction, expressed as a ratio (1: ). [Source: http://iflastandards.info/ns/isbd/unc/elements/P1047] @en
label: has statement of scale @en

tiene público destinatario
type: DatatypeProperty
sub property of: P1091
sub property of: P60520
domain: Recurso
label: Nota de alcance
label: Note on use @en
comment: Relaciona un recurso con una categoría de usuario destinatario del contenido del recurso, o para el que se considera que el contenido es adecuado
comment: Relates a resource to a category of user for which the content of a resource is intended, or for whom the content is considered suitable. [source: http://rdaregistry.info/Elements/u/#P60520] @en
label: has intended audience @en

tiene nota sobre base de descripción
type: DatatypeProperty
sub property of: P1044
sub property of: P60122
domain: Recurso
label: Basis of descripción @en
label: Descripción basada en:
comment: Relaciona un recurso que es una serie o recurso monográfico multiparte con una nota sobre el fascículo, parte, iteración, etc., en que se basa la descripción [Fuente: http://iflastandards.info/ns/isbd/elements/P1044]
comment: Relates a resource that is a series or multipart monograph to a note on the issue, part, iteration, etc., that forms that basis of its description [Source: http://iflastandards.info/ns/isbd/elements/P1044] @en
label: has note on basis of description @en

tiene condiciones de disponibilidad
type: DatatypeProperty
sub property of: P1034
sub property of: P60521
domain: Recurso
label: Precio
label: Price @en
comment: Relaciona un recurso con una mención del precio si está a la venta o una breve mención de otras condiciones si no está a la venta [fuente: http://iflastandards.info/ns/isbd/unc/elements/P1034]
comment: Relates a resource to a statement of the price if it is for sale or a brief statement of other terms if it is not for sale [source: http://iflastandards.info/ns/isbd/unc/elements/P1034] @en
label: has terms of availability @en

tiene ISSN
type: DatatypeProperty
sub property of: P1030
sub property of: P60534
domain: Recurso
label: ISSN @en
comment: Relaciona un recurso con un identificador que ha sido asignado a una serie por una agencia de ISSN
comment: Relates a resource to an identifier that is assigned to a series by an ISSN registration agency [source: http://www.rdaregistry.info/Elements/u/#P60534] @en
label: has ISSN @en

tiene nota de tesis
type: DatatypeProperty
sub property of: P1073
sub property of: P60489
domain: Recurso
label: Nota
label: Note @en
comment: Relaciona un recurso con una mención que identifica una institución académica, grado y año en que el recurso fue presentado
comment: Relates a resource to a statement that identifies an academic institution, degree, and year for which a resource was presented [source: http://www.rdaregistry.info/Elements/u/#P60489] @en
label: has note on dissertation or thesis @en

tiene identificador normalizado
type: DatatypeProperty
sub property of: P1154
sub property of: P60052
domain: Recurso
label: Other standard identifier @en
label: Otros números normalizados
comment: Relaciona un recurso con un identificador normalizado precedido de su etiqueta convencional [fuente: http://iflastandards.info/ns/isbd/elements/P1154 ]
comment: Relates a resource to a standard identifier preceded by its customary label [source: http://iflastandards.info/ns/isbd/elements/P1154 ] @en
label: has standard identifier @en

tiene nota sobre tipo de material o tipo específico de recurso
type: DatatypeProperty
sub property of: P1038
domain: Recurso
label: Nota
label: Note @en
comment: Relaciona un recurso con una nota sobre el área de material o tipo específico de recurso [fuente: http://iflastandards.info/ns/isbd/unc/elements/P1038]
comment: Relates a resource to a note on the material or type of resource specific area [source: http://iflastandards.info/ns/isbd/unc/elements/P1038] @en
label: has note on material type or resource specific type @en

tiene nota sobre el área de edición e historia bibliográfica
type: DatatypeProperty
sub property of: P1038
sub property of: P60135
domain: Recurso
label: Nota sobre la edición
label: Note on edition @en
comment: Relaciona un recurso con una nota sobre el area de edición e historia bibliográfica. [fuente: http://iflastandards.info/ns/isbd/unc/elements/P1037]
comment: Relates a resource to a note on its edition area and bibliographic history. [source: http://iflastandards.info/ns/isbd/unc/elements/P1037] @en
label: has note on edition area and bibliographic history @en

tiene nota de requisitos mínimos del sistema
type: DatatypeProperty
sub property of: P1066
sub property of: P60528
domain: Recurso
label: Requisitos del sistema
label: System requirements @en
comment: Relaciona un recurso electrónico de acceso directo con una nota sobre los requisitos del sistema para el uso del recurso. [fuente: http://iflastandards.info/ns/isbd/unc/elements/P1066]
comment: Relates a resource that is a direct access electronic resource to a note on system requirements for use of the resource. [source: http://iflastandards.info/ns/isbd/unc/elements/P1066] @en
label: has note on system requirements @en

tiene título dependiente de serie o recurso monográfico multiparte
type: DatatypeProperty
domain: Recurso
label: Dependent title of series @en
label: Título dependiente de la serie
label: has dependent title of series or multipart monographic resource @en

tiene nota sobre la relación con recursos continuados
type: DatatypeProperty
domain: Recurso
label: Nota
label: has note on relationship between continuing resources @en

tiene nota de reproducción
type: DatatypeProperty
sub property of: P1098
sub property of: http://rdaregistry.info/Elements/u/#60297
domain: Recurso
label: Nota de versión original
label: Reproduction note @en
comment: Relaciona un recurso que es una reproducción exacta de otro recurso con una nota sobre el título del recurso original (cuando es diferente del de la reproducción) y sus datos de publicación [fuente: http://iflastandards.info/ns/isbd/unc/elements/P1098]
comment: Relates a resource that is is an exact reproduction of another resource to a note on the title of the original resource (when different from the title of the reproduction) and its publication details. [source: http://iflastandards.info/ns/isbd/unc/elements/P1098] @en
label: has note on reproduction @en

tiene fecha de impresión o fabricación
type: DatatypeProperty
domain: Recurso
label: Date of impression or manufacturing @en
label: Fecha de impresión o fabricación
label: has date of printing or manufacturer @en

tiene número normalizado internacional de serie o recurso monográfico multiparte
type: DatatypeProperty
domain: Recurso
label: ISSN de la serie
label: Series ISSN @en
label: has international standard number of series or multipart monographic resource @en

tiene mención de responsabilidad relativa a edición
type: DatatypeProperty
domain: Recurso
label: Edition statement @en
label: Mención de edición
label: has statement of responsibility relating to edition @en

tiene mención de formato musical
type: DatatypeProperty
sub property of: P1014
sub property of: P60488
domain: Recurso
label: Formato musical
comment: Formato musical
comment: Music format @en
comment: Relaciona un recurso de música notada con un término o frase que representa la forma física en la cual se presenta.[Fuente: http://iflastandards.info/ns/isbd/elements/P1014]
comment: Relates a resource that is notated music to a term or phrase representing the physical form in which it is presented. [Source: http://iflastandards.info/ns/isbd/unc/elements/P1014] @en
label: has music format statement @en

tiene nota de serie o recurso monográfico multiparte
type: DatatypeProperty
sub property of: P1041
sub property of: P60101
domain: Recurso
label: Nota de serie
label: Series note @en
comment: Relates a resource to a note on the series and monographic resources area. [Source: http://iflastandards.info/ns/isbd/unc/elements/P1041] @en
comment: Tiene nota de serie o recurso monográfico multiparte [Fuente: http://iflastandards.info/ns/isbd/elements/P1041]
label: has note on series and multipart monographic resources @en

tiene designación de título dependiente de serie o recurso monográfico multiparte
type: DatatypeProperty
domain: Recurso
label: Dependent title of series @en
label: Título dependiente de la serie
label: has dependent title designation of series or multipart monographic resource @en

tiene nota de suplemento a o de insertado en
type: DatatypeProperty
domain: Recurso
label: Suplement to or insert in: @en
label: Suplemento o parte de
label: has note on supplement to or insert in @en

tiene nota de suplementos, insertos, etc
type: DatatypeProperty
sub property of: P1100
sub property of: P60281
domain: Recurso
label: Suplementos:
label: Suplements: @en
comment: Relaciona un recurso que tiene uno o más suplementos y/o insertos con una nota sobre el título, el título clave e ISSN del suplemento y/o el inserto [Fuente: http://iflastandards.info/ns/isbd/elements/P1100]
comment: Relates a resource that has one or more supplements and/or inserts to a note on the title, the key title and ISSN of the supplement and/or insert [Source: http://iflastandards.info/ns/isbd/elements/P1100] @en
label: has note on supplements, inserts, etc. @en

tiene coordenadas
type: DatatypeProperty
domain: Recurso
label: Coordenadas
label: Coordinates @en
label: has coordinates @en

Coordenadas - Longitud Oeste
type: DatatypeProperty
domain: Recurso
label: Longitud Oeste
label: Westernmost longitude @en
label: Coordinates - westernmost longitude @en

tiene nota sobre modo de acceso
type: DatatypeProperty
domain: Recurso
label: Nota sobre modo de acceso
label: Note on mode of access @en
label: has note on mode of access @en

tiene identificador tipográfico
type: DatatypeProperty
domain: Recurso
label: Fingerprint @en
label: Identificador topográfico
label: has fingerprint @en

tiene nota sobre la encuadernación
type: DatatypeProperty
domain: Recurso
label: Nota sobre la encuadernación @en
label: Note on binding @en
label: has note on binding @en

tiene forma del contenido
type: DatatypeProperty
domain: Recurso
label: Content form @en
label: Forma del contenido
label: has content form @en

tiene tipo de medio
type: DatatypeProperty
domain: Recurso
label: Media type @en
label: Tipo de medio
label: has media type @en

tiene ascensión recta y declinación
type: DatatypeProperty
domain: Recurso
label: Cartographic mathematical data @en
label: Datos matemáticos cartográficos
label: has right ascension and declination @en

tipo de recurso
type: DatatypeProperty
domain: Recurso
label: Tipo de recurso
label: type of resource @en

tiene nota de incipit
type: DatatypeProperty
sub property of: P1045
sub property of: P60470
domain: Recurso
label: Nota
comment: First and last words from a manuscript @en
comment: Primeras y últimas palabras de un manuscrito
label: has note of incipit @en

Miniatura
type: DatatypeProperty
label: imagen asociada
label: associated image @en
label: thumbnail @en

Resumen
type: DatatypeProperty
label: abstract @en

Datos del editor o distribuidor
type: DatatypeProperty
sub property of: P60490
label: Datos del editor o distribuidor

Título abreviado
type: DatatypeProperty
sub property of: P30134
label: Título abreviado

Título clave
type: DatatypeProperty
sub property of: P1033
label: Key title @en
label: Título clave

Nota sobre la numeración
type: DatatypeProperty
sub property of: P30062
label: Nota de numeración
label: Note on numeration @en

Otros términos relacionados
type: DatatypeProperty
sub property of: M65306a

En otro soporte
type: DatatypeProperty
sub property of: P60195
label: Otro soporte

Publicación principal
type: DatatypeProperty
sub property of: P60281
label: Publicación principal

Incluido en
type: DatatypeProperty
sub property of: P60101
label: Incluido en

Suplemento
type: DatatypeProperty
sub property of: P60259
label: Suplemento

Periodicidad anterior
type: DatatypeProperty
label: Periodicidad anterior

ISSN correcto
type: DatatypeProperty
label: ISSN

ISSN cancelado
type: DatatypeProperty
label: ISSN (cancelado)

Cualificador del título abreviado
type: DatatypeProperty
label: Cualificador título abreviado

Cualificador del título clave
type: DatatypeProperty
label: Cualificador del título clave

Fecha de comienzo de la periodicidad actual
type: DatatypeProperty
sub property of: P60998
domain: Recurso
comment: Beginning date ot the current publication frequency serial. Dates are included when the beginning date of the current frequency is not the same as the beginning date of publication. @en
comment: Fecha de inicio de la periodicidad actual de una publicación periódica. Se incluyen fechas cuando la fecha de comienzo de la periodicidad actual no es la misma que la fecha de comienzo de la publicación
label: Date of current publication frequency @en

Fechas de la antigua periodicidad
type: DatatypeProperty
sub property of: P60538
domain: Recurso
comment: Dates of former publication frequency or a serial, when a current publication frequency is given @en
comment: Fechas de la periodicidad anterior de una publicación periódica, cuando, cuando existe una periodicidad actual.
label: Dates of former publication frequency @en

Área de difusión (Comunidad Autónoma)
type: DatatypeProperty
label: Área de difusión (Comunidad Autónoma)

Área de difusión (Provincia)
type: DatatypeProperty
label: Área de difusión (Provincia)

Área de difusión (Localidad)
type: DatatypeProperty
label: Área de difusión (Localidad)

Área de difusión (Barrio)
type: DatatypeProperty
label: Área de difusión (Barrio)

País relacionado
type: DatatypeProperty
sub property of: P61014
domain: Recurso
comment: Country Region related to the resource: in serials and old books, is place of publication, and, in maps, geographic area @en
comment: País relacionado con el recurso. Puede hacer referencia al lugar de publicación (en publicaciones periódicas o fondo antiguo), o al lugar geográfico de un mapa
comment: Related country @en

Comunidad autónoma relacionada
type: DatatypeProperty
sub property of: P61014
domain: Recurso
label: Related region @en
comment: Comunidad autónoma relacionada con el recurso. Puede hacer referencia al lugar de publicación (en publicaciones periódicas o fondo antiguo), o al lugar geográfico de un mapa
comment: Region related to the resource: in serials and old books, is place of publication, and, in maps, geographic area @en

Provincia relacionada
type: DatatypeProperty
sub property of: P61014
domain: Recurso
comment: Provincia relacionada con el recurso. Puede hacer referencia al lugar de publicación (en publicaciones periódicas o fondo antiguo), o al lugar geográfico de un mapa
comment: Region related to the resource: in serials and old books, is place of publication, and, in maps, geographic area @en
label: Related province @en

Localidad relacionada
type: DatatypeProperty
sub property of: P61014
domain: Recurso
comment: City or town related to the resource: in serials and old books, is place of publication, and, in maps, geographic area @en
comment: Ciudad o pueblo relacionado con el recurso. Puede hacer referencia al lugar de publicación (en publicaciones periódicas o fondo antiguo), o al lugar geográfico de un mapa
label: Related city or town @en

Tipo de recurso relacionado
type: DatatypeProperty
label: Tipo de recurso relacionado

Signatura
type: DatatypeProperty
label: Signatura

Número de copias
type: DatatypeProperty
label: Número de copias

Fecha de último prestamo
type: DatatypeProperty
label: Fecha del último préstamo

Fecha de última devolución
type: DatatypeProperty
label: Fecha de última devolución

Codigo de barras
type: DatatypeProperty
label: Barcode @en

Número de piezas
type: DatatypeProperty
label: Número de piezas

Localización
type: DatatypeProperty
label: Localización

Biblioteca
type: DatatypeProperty
domain: Ejemplar
label: Biblioteca
comment: This value indicates whether the item is located in the Madrid (BNMADRID) or Alcalá (BNALCALA) buildings @en
comment: Valor que indica si el ejemplar se localiza en la sede de la BNE de Madrid (BNMADRID) o de Alcalá (BNALCALA)

Número de prestamos
type: DatatypeProperty
label: Número de préstamos

Tipo y contenido de nota
type: DatatypeProperty
label: Nota

Precio
type: DatatypeProperty
label: Precio

Circula
type: DatatypeProperty
label: Circula

Permanente
type: DatatypeProperty
label: Permanente

Tipo de ítem
type: DatatypeProperty
label: Tipo

Fecha de creación del item
type: DatatypeProperty
label: Fecha de creación

Esquema de clasificación de la signatura
type: DatatypeProperty
label: Esquema de clasificación de signatura

Tipo de material
type: DatatypeProperty
label: Tipo de material

Procedencia
type: DatatypeProperty
label: Procedencia

tiene nombre de persona
type: DatatypeProperty
domain: Persona
label: Name @en
label: Nombre
label: has name of person @en

tiene fechas de persona
type: DatatypeProperty
domain: Persona
label: Dates @en
label: Fechas asociadas
label: has dates of person @en

tiene calificativo de persona
type: DatatypeProperty
domain: Persona
label: Title, rank or office @en
label: Título, rango, oficio o cargo
label: has title of person @en

nombre completo (persona)
type: DatatypeProperty
domain: Persona
label: Forma completa del nombre
label: Fuller form of name @en
label: fuller form of name (person) @en

tiene biografía o historia
type: DatatypeProperty
domain: Persona
label: Other biographical or historical data @en
label: Otros datos biográficos o históricos
label: has biography or history @en

persona relacionada (persona)
type: DatatypeProperty
domain: Persona
label: Persona relacionada
label: Related person @en
label: related person (person) @en

tiene otras designaciones asociadas con la persona
type: DatatypeProperty
domain: Persona
label: Numeración
label: Numeration @en
label: has other designation associated with the person @en

tiene pseudónimo
type: DatatypeProperty
domain: Persona
label: Nota sobre seudónimos
label: Note on pseudonyms @en
label: has pseudonymous persona @en

entidad relacionada (persona)
type: DatatypeProperty
domain: Persona
label: Entidad o grupo relacionado
label: Related group or body @en
label: related corporate body (person) @en

fecha de nacimiento
type: DatatypeProperty
sub property of: P50121
domain: Persona
label: fecha de nacimiento
comment: Birth date of a person; it may incluye an approximate date of birth if precise date is unknown. @en
comment: Fecha de nacimiento de una persona. Puede tratarse de una fecha aproximada si la fecha precisa es desconocida
label: date of birth @en

fecha de fallecimiento
type: DatatypeProperty
sub property of: P50120
domain: Persona
label: date of death @en
label: fecha de fallecimiento
comment: Death date of a person; it may incluye an approximate date if precise date is unknown. @en
comment: Fecha de fallecimiento de una persona. Puede tratarse de una fecha aproximada si la fecha precisa es desconocida

tiene nombre de entidad corporativa
type: DatatypeProperty
domain: Entidad Corporativa
label: Name @en
label: Nombre
label: has name of the corporate body @en

subordinada jerárquica
type: DatatypeProperty
domain: Entidad Corporativa
label: Entidad subordinada
label: Subordinate unit @en
label: has hierarchical subordinate @en

tiene fecha asociada a la entidad corporativa
type: DatatypeProperty
domain: Entidad Corporativa
label: Date of meeting or treaty signing @en
label: Fecha del congreso o tratado
label: has date associated with the corporate body @en

tiene lugar asociado a la entidad corporativa
type: DatatypeProperty
domain: Entidad Corporativa
label: Lugar del congreso o exhibición
label: Place of congress or exhibition @en
label: has place associated with the corporate body @en

tiene otra variante de nombre (entidad corporativa)
type: DatatypeProperty
domain: Entidad Corporativa
label: Other variant name @en
label: Variantes del nombre
label: has other variant name (corporate body) @en

tiene número asociado a la entidad corporativa
type: DatatypeProperty
domain: Entidad Corporativa
label: Number of meeting @en
label: Número del congreso o exposición
label: has number associated with the corporate body @en

entidad relacionada (entidad corporativa)
type: DatatypeProperty
domain: Entidad Corporativa
label: Entidad o grupo relacionado
label: Related group or body @en
label: related corporate body (corporate body) @en

nota
type: DatatypeProperty
domain: Entidad Corporativa
label: Nota
label: Note @en
label: note @en

persona relacionada (entidad corporativa)
type: DatatypeProperty
domain: Entidad Corporativa
label: Persona relacionada
label: Related person @en
label: related person (corporate body) @en

P7002
type: DatatypeProperty
label: DL

P7003
type: DatatypeProperty
label: ISBN

P7004
type: DatatypeProperty
label: ISSN

P7005
type: DatatypeProperty
label: NIPO

P7006
type: DatatypeProperty
label: Fuente de adquisición

P7007
type: DatatypeProperty
label: Nota de procedencia

P7008
type: DatatypeProperty
label: Información de encuadernación

P7009
type: DatatypeProperty
label: Nota de acción

P7010
type: DatatypeProperty
label: Nota de reproducción

P7011
type: DatatypeProperty
label: Biblioteca

P7012
type: DatatypeProperty
label: Antigua signatura

P7013
type: DatatypeProperty
label: Signatura

P7014
type: DatatypeProperty
label: Localización

P7015
type: DatatypeProperty
label: Enumeración primer nivel

P7016
type: DatatypeProperty
label: Cronología primer nivel

P7017
type: DatatypeProperty
label: Mención textual índices

P7018
type: DatatypeProperty
label: Mención textual fondos

P7019
type: DatatypeProperty
label: Mención textual suplementos

P7020
type: DatatypeProperty
label: Índices

P7021
type: DatatypeProperty
label: Campo de enlace

P7022
type: DatatypeProperty
label: Enumeración segundo nivel

P7023
type: DatatypeProperty
label: Enumeración tercer nivel

P7024
type: DatatypeProperty
label: Campo de enlace

P7025
type: DatatypeProperty
label: Cronología segundo nivel

P7026
type: DatatypeProperty
label: Cronología tercer nivel

BNE id
type: DatatypeProperty
range: Literal
comment: Internal Id number identifying the resource. It is used as a base for HTTP URIs construction @en
comment: Número identificador interno del recurso, usado como base para construir la URI HTTP del recurso

Obra
type: Class
subclass of: C1001
subclass of: C10001
disjoint with: Expresión
disjoint with: Recurso
disjoint with: Ejemplar
disjoint with: Persona
disjoint with: Entidad Corporativa
label: Obra
label: Work @en
comment: A work is an abstract entity; there is no single material object one can point to as the work. We recognize the work through individual realizations or expressions of the work, but the work itself exists only in the commonality of content between and among the various expressions of the work. Because the notion of a work is abstract, it is difficult to define precise boundaries for the entity. The concept of what constitutes a work and where the line of demarcation lies between one work and another may in fact be viewed differently from one culture to another. Consequently the bibliographic conventions established by various cultures or national groups may differ in terms of the criteria they use for determining the boundaries between one work and another. For the purposes of this model variant texts incorporating revisions or updates to an earlier text are viewed simply as expressions of the same work (i.e., the variant texts are not viewed as separate works). Similarly, abridgements or enlargements of an existing text, or the addition of parts or an accompaniment to a musical composition are considered to be different expressions of the same work. Translations from one language to another, musical transcriptions and arrangements, and dubbed or subtitled versions of a film are also considered simply as different expressions of the same original work. By contrast, when the modification of a work involves a significant degree of independent intellectual or artistic effort, the result is viewed, for the purpose of this model, as a new work. Thus paraphrases, rewritings, adaptations for children, parodies, musical variations on a theme and free transcriptions of a musical composition are considered to represent new works. Similarly, adaptations of a work from one literary or art form to another (e.g., dramatizations, adaptations from one medium of the graphic arts to another, etc.) are considered to represent new works. Abstracts, digests and summaries are also conside… @en
comment: Una creación intelectual o artística diferenciada. Una obra es una entidad abstracta; no hay un objeto material único que pueda denominarse la obra. Reconocemos la obra a través de realizaciones individuales o expresiones de la obra; pero la obra en sí solo existe en la comunidad de contenido entre las distintas expresiones de la obra. Cuando hablamos de la Ilíada de Homero como de una obra, nuestro punto de referencia no es un determinado recitado o texto de la obra, sino la creación intelectual que se encuentra tras todas las diferentes expresiones de la obra. Puesto que la noción de obra es abstracta, es difícil definir límites precisos para la entidad. El concepto de lo que constituye una obra y donde está la línea de separación entre una y otra obra puede, de hecho, considerarse de distinta manera en una u otra cultura. Como consecuencia, las convenciones bibliográficas establecidas por distintas culturas o grupos nacionales pueden diferir en los términos de los criterios que utilizan para determinar los límites entre una y otra obra. Para los propósitos de este modelo las variantes de textos que incorporan revisiones o actualizaciones de un texto más antiguo se consideran simplemente como expresiones de la misma obra (es decir, las variantes de textos no se consideran obras independientes). Asimismo, resúmenes o ampliaciones de un texto existente o la adición de partes o un acompañamiento a una composición musical se consideran diferentes expresiones de la misma obra. Las traducciones de una lengua a otra, transcripciones musicales y arreglos y versiones dobladas o subtituladas de una película también se consideran simplemente como diferentes expresiones de una obra original. [fuente: FRBR, traducción al español]

Expresión
type: Class
subclass of: C1002
subclass of: C10006
label: Version @en
label: Versión
comment: An expression is the specific intellectual or artistic form that a work takes each time it is "realized". Expression encompasses, for example, the specific words, sentences, paragraphs, etc. that result from the realization of a work in the form of a text, or the particular sounds, phrasing, etc. resulting from the realization of a musical work. The boundaries of the entity expression are defined, however, so as to exclude aspects of physical form, such as typeface and page layout, that are not integral to the intellectual or artistic realization of the work as such. Inasmuch as the form of expression is an inherent characteristic of the expression, any change in form (e.g., from alpha-numeric notation to spoken word) results in a new expression. Similarly, changes in the intellectual conventions or instruments that are employed to express a work (e.g., translation from one language to another) result in the production of a new expression. [Source: http://iflastandards.info/ns/fr/frbr/frbrer/C1002] @en
comment: La realización intelectual o artística de una obra en forma alfanumérica, musical, notación coreográfica, sonido, imagen, objeto, movimiento, etc., o cualquier combinación de dichas formas. Una expresión es la forma específica intelectual o artística que recibe una obra cada vez que se “realiza”. La expresión incluye, por ejemplo, las palabras concretas, fraseo, párrafos, etc., que son el resultado de la realización de una obra en la forma de un texto, o de notas específicas, estilo, etc., que da como resultado la realización de una obra musical. Sin embargo, se definen los límites de la entidad expresión para excluir aspectos referidos a la forma física tales como la tipografía y los textos de la carátula que no son, en realidad, parte integrante de la realización intelectual o artística de una obra como tal. En la medida en que la forma de expresión es una característica inherente a la expresión, cualquier cambio de esa forma (p. ej., de notación alfanumérica a texto hablado) da como resultado una nueva expresión. Asimismo, los cambios en las convenciones intelectuales o los instrumentos que se emplean para expresar una obra (p. ej., la traducción de una lengua a otra) dan como resultado la producción de una nueva expresión. [fuente: FRBR, traducción al español]
label: Expression @en

Recurso
type: Class
subclass of: C2001
label: Edición
label: Edition @en
comment: An entity, tangible or intangible, that comprises intellectual and/or artistic content and is conceived, produced and/or issued as a unit, forming the basis of a single bibliographic description. Includes text, music, still and moving images, graphics, maps, sound recordings and video recordings, electronic data or programs, including those issued serially.[source: http://iflastandards.info/ns/isbd/elements/C2001] @en
comment: Una entidad, tangible o intangible, que tiene contenido artístico y/o intelectual y que está concebida, producida y/o publicada como una unidad, formando la base de una descripción bibliográfica individual. Incluye texto, música, imágenes fijas y en movimiento, gráficos, mapas, grabaciones sonoras y videograbaciones, programas o datos electrónicos, incluyendo aquellos editados periódicamente. [fuente: ttp://iflastandards.info/ns/isbd/elements/C2001]
label: Resource @en

Ejemplar
type: Class
subclass of: C10003
label: Ejemplar
label: Item @en
comment: The entity defined as item is a concrete entity. It is in many instances a single physical object (e.g., a copy of a one-volume monograph, a single audio cassette, etc.). There are instances, however, where the entity defined as item comprises more than one physical object (e.g., a monograph issued as two separately bound volumes, a recording issued on three separate compact discs, etc.). In terms of intellectual content and physical form, an item exemplifying a manifestation is normally the same as the manifestation itself. However, variations may occur from one item to another, even when the items exemplify the same manifestation, where those variations are the result of actions external to the intent of the producer of the manifestation (e.g., damage occurring after the item was produced, binding performed by a library, etc.). [Source: http://iflastandards.info/ns/fr/frbr/frbrer/C1004, modified] @en
comment: Un ejemplar determinado de un recurso . La entidad definida como ejemplar es una entidad concreta, física y tangible. Se trata, en muchos casos, de un único objeto físico (p. ej., un ejemplar de una monografía en un solo volumen, una cinta de audio, etc.). Sin embargo, hay casos en los que la entidad definida como ítem incluye más de un objeto físico (p. ej., una monografía publicada en dos volúmenes, una grabación publicada en tres discos compactos independientes, etc.). En términos de contenido intelectual y forma física, un ejemplar que ejemplifica un recurso normalmente es el mismo que el propio recurso. Sin embargo, puede haber variaciones de un ejemplar a otro, incluso si ejemplifica el mismo recurso, en el caso de que dichas variaciones sean el resultado de acciones externas a las intenciones del productor (p. ej., daños ocurridos después de que se haya producido el ejemplar, encuadernación llevada a cabo por una biblioteca, etc.) [fuente: FRBR, traducción al español, modificado]

Persona
type: Class
subclass of: http://iflastandards.info/ns/fr/frad/1004
subclass of: C10004
label: Person @en
label: Persona
comment: La entidad Persona comprende tanto individuos en activo como fallecidos, que existan o se crea que hayan existido. En el modelo las personas se tratan como clases en tanto participen en tareas de creación o realización de obras (por ejemplo, como autores, compositores, dibujantes, editores literarios, traductores, intérpretes...), o sean tema de alguna obra (por ejemplo, en biografías, retratos o fotografías...). Este modelo incluye dentro de la clase Persona a familias en su concepto más amplio, en tanto que puedan ser creadores de recursos y objeto de estudio
comment: The entity defined as person encompasses individuals that are deceased as well as those that are living. For the purposes of this model persons are treated as entities only to the extent that they are involved in the creation or realization of a work (e.g., as authors, composers, artists, editors, translators, directors, performers, etc.), or are the subject of a work (e.g., as the subject of a biographical or autobiographical work, of a history, etc.). [Source: http://iflastandards.info/ns/fr/frbr/frbrer/C1005] The entity Persons in BNE also encompasses families acting as a group, either as creator or as subject of resources @en

Entidad Corporativa
type: Class
subclass of: C1006
subclass of: C10005
label: Corporate body @en
label: Entidad
comment: The entity defined as corporate body encompasses organizations and groups of individuals and-or organizations that are identified by a particular name, including occasional groups and groups that are constituted as meetings, conferences, congresses, expeditions, exhibitions, festivals, fairs, etc. The entity also encompasses organizations that act as territorial authorities, exercising or claiming to exercise government functions over a certain territory, such as a federation, a state, a region, a local municipality, etc. The entity encompasses organizations and groups that are defunct as well as those that continue to operate. For the purposes of this model corporate bodies are treated as entities only to the extent that they are involved in the creation or realization of a work (e.g., as the sponsors or endorsers of a work, etc.), or are the subject of a work (e.g., as the subject of a history, etc.). [Source: http://iflastandards.info/ns/fr/frbr/frbrer/C1006] @en
comment: una organización o grupo de individuos y/u organizaciones que actúan como una unidad. La entidad definida como entidad corporativa abarca organizaciones y grupos de individuos y/u organizaciones que se identifican mediante un nombre particular, incluidos grupos ocasionales y grupos que se constituyen como encuentros, conferencias, congresos, expediciones, exposiciones, festivales, ferias, etc, con tal que tengan un nombre que los identifique. La entidad también incluye organizaciones que actúan como autoridades territoriales, que ejercen o pretenden ejercer funciones gubernamentales sobre un determinado territorio, como una federación, un estado, una región, un municipio, etc. La entidad incluye tanto organizaciones y grupos que ya no existen como los que continúan en funcionamiento. [fuente: FRBR, traducción al español]
label: Corporate Body @en